BDBM50213637 (Z)-methyl 2-(3-isopropylphenylimino)-5,5-dimethyl-1,3-thiazinane-3-carbodithioate::CHEMBL246310
SMILES CSC(=S)N1CC(C)(C)CS\C1=N/c1cccc(c1)C(C)C
InChI Key InChIKey=GYWDOIWQFJCHJZ-SDXDJHTJSA-N
Data  1 KI
  Tab Delimited (TSV)   2D SDfile   Computed 3D by Vconf -m prep SDfile
Find this compound or compounds like it in BindingDB:
Activity Spreadsheet -- Enzyme Inhibition Constant Data from BindingDB
Found 1 hit for monomerid = 50213637
TargetCannabinoid receptor 2(Homo sapiens (Human))
Shionogi
Curated by ChEMBL
LigandPNGBDBM50213637((Z)-methyl 2-(3-isopropylphenylimino)-5,5-dimethyl...)
Affinity DataKi:  33nM. Assay description: Displacement of [3H]CP55940 from human CB2 receptor
In DepthDetails ArticlePubMed