BDBM50213662 (S)-1-(2-(3,5-dimethylphenyl)-3-(1-(2-(2-methyl-1H-benzo[d]imidazol-5-yl)ethylamino)propan-2-yl)-6,7-dihydro-1H-pyrrolo[3,2-c]pyridin-5(4H)-yl)-2-(2-fluoro-6-(trifluoromethyl)phenyl)ethanone::CHEMBL231739
SMILES C[C@H](CNCCc1ccc2nc(C)[nH]c2c1)c1c2CN(CCc2[nH]c1-c1cc(C)cc(C)c1)C(=O)Cc1c(F)cccc1C(F)(F)F
InChI Key InChIKey=JDPYVJZHURCBGX-HSZRJFAPSA-N
Data  1 KI  1 IC50
  Tab Delimited (TSV)   2D SDfile   Computed 3D by Vconf -m prep SDfile
Find this compound or compounds like it in BindingDB:
Activity Spreadsheet -- Enzyme Inhibition Constant Data from BindingDB
Found 2 hits for monomerid = 50213662
TargetGonadotropin-releasing hormone receptor(Rattus norvegicus)
Neurocrine Biosciences
Curated by ChEMBL
LigandPNGBDBM50213662((S)-1-(2-(3,5-dimethylphenyl)-3-(1-(2-(2-methyl-1H...)
Affinity DataKi:  1nM. Assay description: Displacement of [125I]-Tyr5, DLeu6, NMeLeu7, Pro-N-Et-GnRH from cloned rat GnRHR
In DepthDetails ArticlePubMed
TargetGonadotropin-releasing hormone receptor(Homo sapiens (Human))
Neurocrine Biosciences
Curated by ChEMBL
LigandPNGBDBM50213662((S)-1-(2-(3,5-dimethylphenyl)-3-(1-(2-(2-methyl-1H...)
Affinity DataIC50:  87nM. Assay description: Inhibition of human GnRHR expressed in RBL cells assessed as inhibition of GnRH-stimulated [3H]-inositol phosphate hydrolysis
In DepthDetails ArticlePubMed