BDBM50214133 4-(((4-chlorophenethyl)(1-(2,6-difluorobenzoyl)piperidin-4-yl)amino)methyl)-2-(4-aminophenyl)-1,5-dimethyl-1,2-dihydropyrazol-3-one::CHEMBL246339
SMILES Cc1c(CN(CCc2ccc(Cl)cc2)C2CCN(CC2)C(=O)c2c(F)cccc2F)c(=O)n(-c2ccc(N)cc2)n1C
InChI Key InChIKey=AQIPJIQPPWTJAY-UHFFFAOYSA-N
Data  1 IC50
  Tab Delimited (TSV)   2D SDfile   Computed 3D by Vconf -m prep SDfile
Find this compound or compounds like it in BindingDB:
Activity Spreadsheet -- Enzyme Inhibition Constant Data from BindingDB
Found 1 hit for monomerid = 50214133
TargetC-C chemokine receptor type 3(Homo sapiens (Human))
Ucb Pharma
Curated by ChEMBL
LigandPNGBDBM50214133(4-(((4-chlorophenethyl)(1-(2,6-difluorobenzoyl)pip...)
Affinity DataIC50:  79nM. Assay description: Displacement of [125I]eotaxin from CCR3 receptor in human eosinophils
In DepthDetails ArticlePubMed