BDBM50214295 CHEMBL91221
SMILES COc1cc(Cl)c(Cl)cc1C(=O)CCCCN1CCC2(CC1)NC(=O)NC2=O
InChI Key InChIKey=GIWWCFJNCWGLAP-UHFFFAOYSA-N
Data  3 KI
  Tab Delimited (TSV)   2D SDfile   Computed 3D by Vconf -m prep SDfile
Find this compound or compounds like it in BindingDB:
Activity Spreadsheet -- Enzyme Inhibition Constant Data from BindingDB
Found 3 hits for monomerid = 50214295
Target5-hydroxytryptamine receptor 2C(Homo sapiens (Human))TBA
LigandPNGBDBM50214295(CHEMBL91221)
Affinity DataKi:  0.251nM. Assay description: Displacement of [3H]mesulergine from human cloned 5-hydroxytryptamine 2C receptor expressed in CHO-K1 cells
In DepthDetails
Target5-hydroxytryptamine receptor 2A(Homo sapiens (Human))TBA
LigandPNGBDBM50214295(CHEMBL91221)
Affinity DataKi:  6.30nM. Assay description: Compound was evaluated for displacement of [3H]ketanserin from human cloned 5-hydroxytryptamine 2A receptor in transfected CHO-K1 cells
In DepthDetails
Target5-hydroxytryptamine receptor 2B(Homo sapiens (Human))TBA
LigandPNGBDBM50214295(CHEMBL91221)
Affinity DataKi:  6.30nM. Assay description: Displacement of [3H]-5-5HT from human cloned 5-hydroxytryptamine 2B receptor expressed in CHO-K1 cells
In DepthDetails