BDBM50214337 CHEMBL327343
SMILES Oc1nc2cc(Cl)c(Cl)[n+]([O-])c2nc1O
InChI Key InChIKey=WTNAHNSTLDMDOU-UHFFFAOYSA-N
Data  1 KI
  Tab Delimited (TSV)   2D SDfile   Computed 3D by Vconf -m prep SDfile
Find this compound or compounds like it in BindingDB:
Activity Spreadsheet -- Enzyme Inhibition Constant Data from BindingDB
Found 1 hit for monomerid = 50214337
LigandPNGBDBM50214337(CHEMBL327343)
Affinity DataKi:  112nM. Assay description: In vitro binding affinity for glycine site on the NMDA receptor.
In DepthDetails