BDBM50214349 CHEMBL52899
SMILES [H][C@@]12CC[C@H](O)[C@@]1(C)CC[C@]1([H])c3cc\c(=N/C)c(O)cc3CC[C@@]21[H]
InChI Key InChIKey=ZOEOHAILNDRJRU-ZGMAETJZSA-N
Data  1 IC50
  Tab Delimited (TSV)   2D SDfile   Computed 3D by Vconf -m prep SDfile
Find this compound or compounds like it in BindingDB:
Activity Spreadsheet -- Enzyme Inhibition Constant Data from BindingDB
Found 1 hit for monomerid = 50214349
LigandPNGBDBM50214349(CHEMBL52899)
Affinity DataIC50:  6.07E+4nM. Assay description: Compound was evaluated for inhibition of tubulin polymerization using purified bovine brain tubulin, activity expressed as IC50
In DepthDetails