BDBM50214461 3-(2-(3-acetamidophenylamino)-8-cyanopyrazolo[1,5-a][1,3,5]triazin-4-ylamino)-N-(2-(dimethylamino)ethyl)benzamide::CHEMBL230781
SMILES CN(C)CCNC(=O)c1cccc(Nc2nc(Nc3cccc(NC(C)=O)c3)nc3c(cnn23)C#N)c1
InChI Key InChIKey=NBSVDPZIOKKIOZ-UHFFFAOYSA-N
Data  1 KI
  Tab Delimited (TSV)   2D SDfile   Computed 3D by Vconf -m prep SDfile
Find this compound or compounds like it in BindingDB:
Activity Spreadsheet -- Enzyme Inhibition Constant Data from BindingDB
Found 1 hit for monomerid = 50214461
TargetCasein kinase II subunit alpha(Homo sapiens (Human))
Polaris Pharmaceuticals
Curated by ChEMBL
LigandPNGBDBM50214461(3-(2-(3-acetamidophenylamino)-8-cyanopyrazolo[1,5-...)
Affinity DataKi:  190nM. Assay description: Inhibition of human CK2 alpha
In DepthDetails ArticlePubMed