BDBM50214692 1-{4-[(1R)-2-(1-amino-3-methylbutyl)-6-fluorophenyl]-4-[(2R)-acetamido-3-(2,4-dichlorophenyl)propionyl]}-piperazine::CHEMBL237266
SMILES CC(C)C[C@@H](N)c1cccc(F)c1N1CCN(CC1)C(=O)[C@@H](Cc1ccc(Cl)cc1Cl)NC(C)=O
InChI Key InChIKey=UNZSGTNRPMCZPA-DNQXCXABSA-N
Data  1 KI
  Tab Delimited (TSV)   2D SDfile   Computed 3D by Vconf -m prep SDfile
Find this compound or compounds like it in BindingDB:
Activity Spreadsheet -- Enzyme Inhibition Constant Data from BindingDB
Found 1 hit for monomerid = 50214692
TargetMelanocortin receptor 4(Homo sapiens (Human))
Neurocrine Biosciences
Curated by ChEMBL
LigandPNGBDBM50214692(1-{4-[(1R)-2-(1-amino-3-methylbutyl)-6-fluoropheny...)
Affinity DataKi:  6nM. Assay description: Displacement of [125I]NDP-MSH from MC4R receptor in HEK293 cells
In DepthDetails ArticlePubMed