BDBM50214851 CHEMBL340518
SMILES CCc1nn(Cc2ccc(cc2)-c2ccccc2-c2nn[nH]n2)\c(=N\C(=O)c2ccc(F)cc2)s1
InChI Key InChIKey=XVFMBIHBWXADDL-RFBIWTDZSA-N
Data  1 KI
  Tab Delimited (TSV)   2D SDfile   Computed 3D by Vconf -m prep SDfile
Find this compound or compounds like it in BindingDB:
Activity Spreadsheet -- Enzyme Inhibition Constant Data from BindingDB
Found 1 hit for monomerid = 50214851
LigandPNGBDBM50214851(CHEMBL340518)
Affinity DataKi:  102nM. Assay description: Inhibition of binding of [125I]All at the angiotensin II type 1 receptor (AT1 receptor) in rat liver membranes
In DepthDetails