BDBM50214965 (Z)-2-(4-(4-(4-bromophenyl)-7-morpholinohept-2-en-5-ynyloxy)-2-methylphenoxy)acetic acid::CHEMBL234692
SMILES Cc1cc(OC\C=C/C(C#CCN2CCOCC2)c2ccc(Br)cc2)ccc1OCC(O)=O
InChI Key InChIKey=TURWXHMBZBAIQB-HYXAFXHYSA-N
Data  3 EC50
  Tab Delimited (TSV)   2D SDfile   Computed 3D by Vconf -m prep SDfile
Find this compound or compounds like it in BindingDB:
Activity Spreadsheet -- Enzyme Inhibition Constant Data from BindingDB
Found 3 hits for monomerid = 50214965
TargetPeroxisome proliferator-activated receptor delta(Homo sapiens (Human))
Re&D Vufb
Curated by ChEMBL
LigandPNGBDBM50214965((Z)-2-(4-(4-(4-bromophenyl)-7-morpholinohept-2-en-...)
Affinity DataEC50:  3.00E+3nM. Assay description: Agonist activity at human PPARdelta by transactivation assay
In DepthDetails ArticlePubMed
TargetPeroxisome proliferator-activated receptor alpha(Homo sapiens (Human))
Re&D Vufb
Curated by ChEMBL
LigandPNGBDBM50214965((Z)-2-(4-(4-(4-bromophenyl)-7-morpholinohept-2-en-...)
Affinity DataEC50: >1.00E+4nM. Assay description: Agonist activity at human PPARalpha by transactivation assay
In DepthDetails ArticlePubMed
TargetPeroxisome proliferator-activated receptor gamma(Homo sapiens (Human))
Re&D Vufb
Curated by ChEMBL
LigandPNGBDBM50214965((Z)-2-(4-(4-(4-bromophenyl)-7-morpholinohept-2-en-...)
Affinity DataEC50: >1.00E+4nM. Assay description: Agonist activity at human PPARgamma by transactivation assay
In DepthDetails ArticlePubMed