BDBM50215107 CHEMBL3143638
SMILES CC(=O)OCOP1(=O)OC[C@@H]2O[C@H]([C@H](O)[C@@H]2O1)n1c(nc2c(N)ncnc12)N1CCCCC1
InChI Key InChIKey=CNYSCQZVHOVWSF-JGQZMUMYSA-N
Data  1 EC50
  Tab Delimited (TSV)   2D SDfile   Computed 3D by Vconf -m prep SDfile
Find this compound or compounds like it in BindingDB:
Activity Spreadsheet -- Enzyme Inhibition Constant Data from BindingDB
Found 1 hit for monomerid = 50215107
LigandPNGBDBM50215107(CHEMBL3143638)
Affinity DataEC50:  1.00E+4nM. Assay description: Activation of cAMP dependent protein kinase (PKA)
In DepthDetails