BDBM50215621 1-(4-(5-acetylthiophen-2-yl)cyclohex-3-enyl)-3-(3-chloro-4-fluorophenyl)-1-(2-(pyrrolidin-1-yl)ethyl)urea::CHEMBL390290
SMILES CC(=O)c1ccc(s1)C1=CCC(CC1)N(CCN1CCCC1)C(=O)Nc1ccc(F)c(Cl)c1
InChI Key InChIKey=JPJRQKREDRIUHQ-UHFFFAOYSA-N
Data  1 KI
  Tab Delimited (TSV)   2D SDfile   Computed 3D by Vconf -m prep SDfile
Find this compound or compounds like it in BindingDB:
Activity Spreadsheet -- Enzyme Inhibition Constant Data from BindingDB
Found 1 hit for monomerid = 50215621
TargetMelanin-concentrating hormone receptor 1(Homo sapiens (Human))
Schering-Plough Research Institute
Curated by ChEMBL
LigandPNGBDBM50215621(1-(4-(5-acetylthiophen-2-yl)cyclohex-3-enyl)-3-(3-...)
Affinity DataKi:  31nM. Assay description: Displacement of [125I]MCH from MCHR1 expressed in CHO cells
In DepthDetails ArticlePubMed