BDBM50215631 3-(3-chloro-4-fluorophenyl)-1-(4-(5-methylthiophen-2-yl)cyclohex-3-enyl)-1-(2-(pyrrolidin-1-yl)ethyl)urea::CHEMBL229408
SMILES Cc1ccc(s1)C1=CCC(CC1)N(CCN1CCCC1)C(=O)Nc1ccc(F)c(Cl)c1
InChI Key InChIKey=BWGKUHVGLLNUIX-UHFFFAOYSA-N
Data  1 KI
  Tab Delimited (TSV)   2D SDfile   Computed 3D by Vconf -m prep SDfile
Find this compound or compounds like it in BindingDB:
Activity Spreadsheet -- Enzyme Inhibition Constant Data from BindingDB
Found 1 hit for monomerid = 50215631
TargetMelanin-concentrating hormone receptor 1(Homo sapiens (Human))
Schering-Plough Research Institute
Curated by ChEMBL
LigandPNGBDBM50215631(3-(3-chloro-4-fluorophenyl)-1-(4-(5-methylthiophen...)
Affinity DataKi:  85nM. Assay description: Displacement of [125I]MCH from MCHR1 expressed in CHO cells
In DepthDetails ArticlePubMed