BDBM50215703 CHEMBL2372746
SMILES [#6]-[#6]-[#6@H](-[#6])-[#6@H](-[#7]-[#6](=O)-[#6@H](-[#6]-[#6]-[#6]-[#6]-[#7])-[#7]-[#6](=O)-c1cc(-[#8])ccc1-[#8])-[#6](=O)-[#7]-[#6@@H](-[#6]-[#6]-[#6]\[#7]=[#6](\[#7])-[#7])-[#6](=O)-[#7]-[#6@@H](-[#6]-[#6])-[#6](-[#8])=O
InChI Key InChIKey=GXSFDCINBOQYAD-BQSWGBOTSA-N
Data  1 IC50
  Tab Delimited (TSV)   2D SDfile   Computed 3D by Vconf -m prep SDfile
Find this compound or compounds like it in BindingDB:
Activity Spreadsheet -- Enzyme Inhibition Constant Data from BindingDB
Found 1 hit for monomerid = 50215703
TargetProthrombin(Homo sapiens (Human))
Central Drug Research Institute
Curated by ChEMBL
LigandPNGBDBM50215703(CHEMBL2372746)
Affinity DataIC50:  2.60E+4nMpH: 8.3Assay Description:Anti-thrombin activity by competitive enzyme assay using the fluorogenic substrate Tos-Gly-Pro-Arg-AMC at pH 8.3.
In DepthDetails ArticlePubMed