BDBM50216011 6-(benzylamino)-N-hydroxybenzo[b]thiophene-2-carboxamide::CHEMBL245749
SMILES ONC(=O)c1cc2ccc(NCc3ccccc3)cc2s1
InChI Key InChIKey=PXAZSFUSHCSCKL-UHFFFAOYSA-N
Data  1 IC50
  Tab Delimited (TSV)   2D SDfile   Computed 3D by Vconf -m prep SDfile
Find this compound or compounds like it in BindingDB:
Activity Spreadsheet -- Enzyme Inhibition Constant Data from BindingDB
Found 1 hit for monomerid = 50216011
TargetHistone deacetylase 1(Homo sapiens (Human))
Merck Research Laboratories
Curated by ChEMBL
LigandPNGBDBM50216011(6-(benzylamino)-N-hydroxybenzo[b]thiophene-2-carbo...)
Affinity DataIC50:  55nM. Assay description: Inhibition of HDAC1
In DepthDetails ArticlePubMed