BDBM50216057 CHEMBL226539::N-[6,7-dimethoxy-3,4-dihydro-1H-isoquinolin-2-yl-butyl]-2-(2-fluoro-ethoxy)-5-methyl-benzamide
SMILES COc1cc2CCN(CCCCNC(=O)c3cc(C)ccc3OCCF)Cc2cc1OC
InChI Key InChIKey=QVRVXSZKCXFBTE-UHFFFAOYSA-N
Data  2 KI
  Tab Delimited (TSV)   2D SDfile   Computed 3D by Vconf -m prep SDfile
Find this compound or compounds like it in BindingDB:
Activity Spreadsheet -- Enzyme Inhibition Constant Data from BindingDB
Found 2 hits for monomerid = 50216057
TargetSigma non-opioid intracellular receptor 1(Cavia porcellus (Guinea pig))
Washington University
Curated by ChEMBL
LigandPNGBDBM50216057(CHEMBL226539 | N-[6,7-dimethoxy-3,4-dihydro-1H-iso...)
Affinity DataKi:  330nM. Assay description: Displacement of [3H](+)pentazocine from sigma 1 receptor in guinea pig brain membrane after 90 mins
In DepthDetails ArticlePubMed
TargetSigma non-opioid intracellular receptor 1(Mus musculus (Mouse))
Washington University
Curated by ChEMBL
LigandPNGBDBM50216057(CHEMBL226539 | N-[6,7-dimethoxy-3,4-dihydro-1H-iso...)
Affinity DataKi:  330nM. Assay description: Displacement of 5-bromo-N-(4-(3,4-dihydro-6,7-dimethoxyisoquinolin-2(1H)-yl)butyl)-2,3-dimethoxybenzamide from sigma-1 receptor in mouse EMT6 cell me...
In DepthDetails ArticlePubMed