BDBM50216071 (2S)-N-[(1S)-4-carbamimidamido-1-{[(1S)-1-carbamoyl-2-(1H-indol-3-yl)ethyl]carbamoyl}butyl]-2-{2-[(2S)-2-[(3-hydroxyphenyl)formamido]-3-phenylpropanamido]acetamido}-4-methylpentanamide::CHEMBL226566
SMILES CC(C)C[C@H](NC(=O)CNC(=O)[C@H](Cc1ccccc1)NC(=O)c1cccc(O)c1)C(=O)N[C@@H](CCCN=C(N)N)C(=O)N[C@@H](Cc1c[nH]c2ccccc12)C(N)=O
InChI Key InChIKey=HSCIMEIXFCJBEF-CUPIEXAXSA-N
Data  1 EC50
  Tab Delimited (TSV)   2D SDfile   Computed 3D by Vconf -m prep SDfile
Find this compound or compounds like it in BindingDB:
Activity Spreadsheet -- Enzyme Inhibition Constant Data from BindingDB
Found 1 hit for monomerid = 50216071
TargetKiSS-1 receptor(Homo sapiens (Human))
Kyoto University
Curated by ChEMBL
LigandPNGBDBM50216071((2S)-N-[(1S)-4-carbamimidamido-1-{[(1S)-1-carbamoy...)
Affinity DataEC50:  1.20nM. Assay description: Agonist activity at GPR54 expressed in CHO cells assessed as intracellular calcium mobilization
In DepthDetails ArticlePubMed