BDBM50216226 CHEMBL329023
SMILES COc1ccc(C(=O)Nc2c(Cl)cncc2Cl)c2nc(C3CCCC3)n(C)c12
InChI Key InChIKey=FZGLZPNZCVMSQV-UHFFFAOYSA-N
Data  1 IC50
  Tab Delimited (TSV)   2D SDfile   Computed 3D by Vconf -m prep SDfile
Find this compound or compounds like it in BindingDB:
Activity Spreadsheet -- Enzyme Inhibition Constant Data from BindingDB
Found 1 hit for monomerid = 50216226
TargetcAMP-specific 3',5'-cyclic phosphodiesterase 4A/4B/4C/4D(Homo sapiens (Human))
Rh£Ne-Poulenc Rorer
Curated by ChEMBL
LigandPNGBDBM50216226(CHEMBL329023)
Affinity DataIC50:  4.40E+3nM. Assay description: Inhibition of PDE4 from guinea pig macrophages
In DepthDetails ArticlePubMed