BDBM50216259 CHEMBL430828
SMILES COc1ccc(cc1OC)S(=O)(=O)NCCC#N
InChI Key InChIKey=VANKWUOPPVEVOP-UHFFFAOYSA-N
Data  2 IC50
  Tab Delimited (TSV)   2D SDfile   Computed 3D by Vconf -m prep SDfile
Find this compound or compounds like it in BindingDB:
Activity Spreadsheet -- Enzyme Inhibition Constant Data from BindingDB
Found 2 hits for monomerid = 50216259
TargetcAMP-specific 3',5'-cyclic phosphodiesterase 4A/4B/4C/4D(Homo sapiens (Human))
Chiroscience
Curated by ChEMBL
LigandPNGBDBM50216259(CHEMBL430828)
Affinity DataIC50:  5.00E+4nM. Assay description: Binding activity towards Rolipram binding site of phosphodiesterase 4
In DepthDetails ArticlePubMed
TargetcAMP-specific 3',5'-cyclic phosphodiesterase 4A/4B/4C/4D(Homo sapiens (Human))
Chiroscience
Curated by ChEMBL
LigandPNGBDBM50216259(CHEMBL430828)
Affinity DataIC50:  1.76E+4nM. Assay description: Inhibition of phosphodiesterase 4
In DepthDetails ArticlePubMed