BDBM50216288 CHEMBL88699
SMILES COc1ccc(cc1OC)S(=O)(=O)N(Cc1ccccc1)Cc1ccccn1
InChI Key InChIKey=LMHXBLFWHDYBRJ-UHFFFAOYSA-N
Data  1 IC50
  Tab Delimited (TSV)   2D SDfile   Computed 3D by Vconf -m prep SDfile
Find this compound or compounds like it in BindingDB:
Activity Spreadsheet -- Enzyme Inhibition Constant Data from BindingDB
Found 1 hit for monomerid = 50216288
TargetcAMP-specific 3',5'-cyclic phosphodiesterase 4A/4B/4C/4D(Homo sapiens (Human))
Chiroscience
Curated by ChEMBL
LigandPNGBDBM50216288(CHEMBL88699)
Affinity DataIC50:  7.80E+3nM. Assay description: In vitro binding activity towards catalytic site of phosphodiesterase 4
In DepthDetails ArticlePubMed