BDBM50216413 CHEMBL397196::isoquinolinesulfon-5-yl-{2-[4-(4-methoxyphenyl)piperazin-1-yl]-2-oxoethyl}amide
SMILES COc1ccc(cc1)N1CCN(CC1)C(=O)CNS(=O)(=O)c1cccc2cnccc12
InChI Key InChIKey=WBNNUMXWNRPPLJ-UHFFFAOYSA-N
Data  1 IC50
  Tab Delimited (TSV)   2D SDfile   Computed 3D by Vconf -m prep SDfile
Find this compound or compounds like it in BindingDB:
Activity Spreadsheet -- Enzyme Inhibition Constant Data from BindingDB
Found 1 hit for monomerid = 50216413
TargetP2X purinoceptor 7(Homo sapiens (Human))
Università
Curated by ChEMBL
LigandPNGBDBM50216413(CHEMBL397196 | isoquinolinesulfon-5-yl-{2-[4-(4-me...)
Affinity DataIC50: >1.00E+3nM. Assay description: Antagonist activity at human P2X7 receptor expressed in HEK293 cells assessed as effect on intracellular calcium influx
In DepthDetails ArticlePubMed