BDBM50216447 CHEMBL246933::N-(4-(7-methyl-2H-chromene-3-carboxamido)benzyl)-N,N-dimethyl-tetrahydro-2H-pyran-4-aminium
SMILES Cc1ccc2C=C(COc2c1)C(=O)Nc1ccc(C[N+](C)(C)C2CCOCC2)cc1
InChI Key InChIKey=FVKYPFKYQOEVNL-UHFFFAOYSA-O
Data  1 IC50
  Tab Delimited (TSV)   2D SDfile   Computed 3D by Vconf -m prep SDfile
Find this compound or compounds like it in BindingDB:
Activity Spreadsheet -- Enzyme Inhibition Constant Data from BindingDB
Found 1 hit for monomerid = 50216447
TargetC-C chemokine receptor type 2(Homo sapiens (Human))
Johnson & Johnson Pharmaceutical Research And Development
Curated by ChEMBL
LigandPNGBDBM50216447(CHEMBL246933 | N-(4-(7-methyl-2H-chromene-3-carbox...)
Affinity DataIC50:  170nM. Assay description: Displacement of [125I]MCP1 from CCR2 receptor expressed in THP1 cells
In DepthDetails ArticlePubMed