BDBM50216523 6-propyl-4,6-dihydro-2H-furo[3,4-c]pyrazole-3-carboxylic acid::CHEMBL393086
SMILES CCCC1OCc2c1n[nH]c2C(O)=O
InChI Key InChIKey=MZHGWYSOSZWFRR-UHFFFAOYSA-N
Data  1 EC50
  Tab Delimited (TSV)   2D SDfile   Computed 3D by Vconf -m prep SDfile
Find this compound or compounds like it in BindingDB:
Activity Spreadsheet -- Enzyme Inhibition Constant Data from BindingDB
Found 1 hit for monomerid = 50216523
TargetHydroxycarboxylic acid receptor 2(Homo sapiens (Human))
Arena Pharmaceuticals
Curated by ChEMBL
LigandPNGBDBM50216523(6-propyl-4,6-dihydro-2H-furo[3,4-c]pyrazole-3-carb...)
Affinity DataEC50:  2.10E+3nM. Assay description: Agonist activity at human cloned GPR109a receptor by forskolin-stimulated cAMP production test
In DepthDetails ArticlePubMed