BDBM50216611 CHEMBL233541::N-[(1S,2R)-2-[(4-chlorobenzene)amido]cyclohexyl]-4-(2-oxo-1,2-dihydropyridin-1-yl)benzamide
SMILES Clc1ccc(cc1)C(=O)N[C@@H]1CCCC[C@@H]1NC(=O)c1ccc(cc1)-n1ccccc1=O
InChI Key InChIKey=PVHIDGNAYYCPOX-YADHBBJMSA-N
Data  1 KI
  Tab Delimited (TSV)   2D SDfile   Computed 3D by Vconf -m prep SDfile
Find this compound or compounds like it in BindingDB:
Activity Spreadsheet -- Enzyme Inhibition Constant Data from BindingDB
Found 1 hit for monomerid = 50216611
TargetCoagulation factor X(Homo sapiens (Human))
Bristol-Myers Squibb
Curated by ChEMBL
LigandPNGBDBM50216611(CHEMBL233541 | N-[(1S,2R)-2-[(4-chlorobenzene)amid...)
Affinity DataKi:  37nM. Assay description: Inhibition of human factor 10a
In DepthDetails ArticlePubMed