BDBM50216737 3-hydroxy-5-(2-methylquinolin-7-yl)benzonitrile::CHEMBL233618
SMILES Cc1ccc2ccc(cc2n1)-c1cc(O)cc(c1)C#N
InChI Key InChIKey=DYISJDYQAJMMQY-UHFFFAOYSA-N
Data  1 IC50
  Tab Delimited (TSV)   2D SDfile   Computed 3D by Vconf -m prep SDfile
Find this compound or compounds like it in BindingDB:
Activity Spreadsheet -- Enzyme Inhibition Constant Data from BindingDB
Found 1 hit for monomerid = 50216737
TargetMetabotropic glutamate receptor 5(Rattus norvegicus (Rat))
Pfizer
Curated by ChEMBL
LigandPNGBDBM50216737(3-hydroxy-5-(2-methylquinolin-7-yl)benzonitrile | ...)
Affinity DataIC50:  360nM. Assay description: Activity at rat mGlu5 receptor expressed in CHO cells assessed as inhibition of quisqualate-stimulated calcium mobilization by FLIPR assay
In DepthDetails ArticlePubMed