BDBM50216746 3-fluoro-5-(2-methylquinolin-7-yl)benzonitrile::CHEMBL232188
SMILES Cc1ccc2ccc(cc2n1)-c1cc(F)cc(c1)C#N
InChI Key InChIKey=SDOLISUYGVMVBK-UHFFFAOYSA-N
Data  1 KI  1 IC50
  Tab Delimited (TSV)   2D SDfile   Computed 3D by Vconf -m prep SDfile
Find this compound or compounds like it in BindingDB:
Activity Spreadsheet -- Enzyme Inhibition Constant Data from BindingDB
Found 2 hits for monomerid = 50216746
TargetMetabotropic glutamate receptor 5(Rattus norvegicus (Rat))
Pfizer
Curated by ChEMBL
LigandPNGBDBM50216746(3-fluoro-5-(2-methylquinolin-7-yl)benzonitrile | C...)
Affinity DataKi:  22nM. Assay description: Displacement of [3H]MPEP from mGlu5 receptor in rat brain
In DepthDetails ArticlePubMed
TargetMetabotropic glutamate receptor 5(Rattus norvegicus (Rat))
Pfizer
Curated by ChEMBL
LigandPNGBDBM50216746(3-fluoro-5-(2-methylquinolin-7-yl)benzonitrile | C...)
Affinity DataIC50:  0.800nM. Assay description: Activity at rat mGlu5 receptor expressed in CHO cells assessed as inhibition of quisqualate-stimulated calcium mobilization by FLIPR assay
In DepthDetails ArticlePubMed