BDBM50216815 (3R)-6-cyclohexyl-N-hydroxy-3-[3-(1H-pyrazol-3-yl)-1,2,4-oxadiazol-5-yl]hexanamide::CHEMBL226801
SMILES ONC(=O)C[C@@H](CCCC1CCCCC1)c1nc(no1)-c1cc[nH]n1
InChI Key InChIKey=WEIHNHZCYKEJPD-CYBMUJFWSA-N
Data  1 IC50
  Tab Delimited (TSV)   2D SDfile   Computed 3D by Vconf -m prep SDfile
Find this compound or compounds like it in BindingDB:
Activity Spreadsheet -- Enzyme Inhibition Constant Data from BindingDB
Found 1 hit for monomerid = 50216815
TargetBone morphogenetic protein 1(Homo sapiens (Human))
Pfizer
Curated by ChEMBL
LigandPNGBDBM50216815((3R)-6-cyclohexyl-N-hydroxy-3-[3-(1H-pyrazol-3-yl)...)
Affinity DataIC50:  74nM. Assay description: Inhibition of human procollagen C-proteinase expressed in CHO cells
In DepthDetails ArticlePubMed