BDBM50216833 (3R)-6-cyclohexyl-3-{3-[(cyclopropylamino)methyl]-1,2,4-oxadiazol-5-yl}-Nhydroxyhexanamide::CHEMBL229813
SMILES ONC(=O)C[C@@H](CCCC1CCCCC1)c1nc(CNC2CC2)no1
InChI Key InChIKey=QJFOXZKOYGQQLX-CQSZACIVSA-N
Data  1 IC50
  Tab Delimited (TSV)   2D SDfile   Computed 3D by Vconf -m prep SDfile
Find this compound or compounds like it in BindingDB:
Activity Spreadsheet -- Enzyme Inhibition Constant Data from BindingDB
Found 1 hit for monomerid = 50216833
TargetBone morphogenetic protein 1(Homo sapiens (Human))
Pfizer
Curated by ChEMBL
LigandPNGBDBM50216833((3R)-6-cyclohexyl-3-{3-[(cyclopropylamino)methyl]-...)
Affinity DataIC50:  6nM. Assay description: Inhibition of human procollagen C-proteinase expressed in CHO cells
In DepthDetails ArticlePubMed