BDBM50216960 (S)-2-(5-(2-(5-methyl-2-p-tolylthiazol-4-yl)ethoxy)-2,3-dihydro-1H-inden-1-yl)acetic acid::CHEMBL248411
SMILES Cc1sc(nc1CCOc1ccc2[C@H](CC(O)=O)CCc2c1)-c1ccc(C)cc1
InChI Key InChIKey=ABJIJOALHMGIMB-IBGZPJMESA-N
Data  2 EC50
  Tab Delimited (TSV)   2D SDfile   Computed 3D by Vconf -m prep SDfile
Find this compound or compounds like it in BindingDB:
Activity Spreadsheet -- Enzyme Inhibition Constant Data from BindingDB
Found 2 hits for monomerid = 50216960
TargetPeroxisome proliferator-activated receptor gamma(Homo sapiens (Human))
Bayer Research Center
Curated by ChEMBL
LigandPNGBDBM50216960((S)-2-(5-(2-(5-methyl-2-p-tolylthiazol-4-yl)ethoxy...)
Affinity DataEC50:  0.800nM. Assay description: Agonist activity at GST-tagged human PPARdelta by FRET assay
In DepthDetails ArticlePubMed
TargetPeroxisome proliferator-activated receptor alpha(Homo sapiens (Human))
Bayer Research Center
Curated by ChEMBL
LigandPNGBDBM50216960((S)-2-(5-(2-(5-methyl-2-p-tolylthiazol-4-yl)ethoxy...)
Affinity DataEC50:  594nM. Assay description: Agonist activity at PPARalpha by FRET assay
In DepthDetails ArticlePubMed