BDBM50216970 2-(6-(2-(5-methyl-2-phenyloxazol-4-yl)ethoxy)-2,3-dihydrobenzofuran-3-yl)acetic acid::CHEMBL246201
SMILES Cc1oc(nc1CCOc1ccc2C(CC(O)=O)COc2c1)-c1ccccc1
InChI Key InChIKey=LNIBCKWAMCKSNE-UHFFFAOYSA-N
Data  2 EC50
  Tab Delimited (TSV)   2D SDfile   Computed 3D by Vconf -m prep SDfile
Find this compound or compounds like it in BindingDB:
Activity Spreadsheet -- Enzyme Inhibition Constant Data from BindingDB
Found 2 hits for monomerid = 50216970
TargetPeroxisome proliferator-activated receptor gamma(Homo sapiens (Human))
Bayer Research Center
Curated by ChEMBL
LigandPNGBDBM50216970(2-(6-(2-(5-methyl-2-phenyloxazol-4-yl)ethoxy)-2,3-...)
Affinity DataEC50:  1.00E+4nM. Assay description: Agonist activity at GST-tagged human PPARdelta by FRET assay
In DepthDetails ArticlePubMed
TargetPeroxisome proliferator-activated receptor alpha(Homo sapiens (Human))
Bayer Research Center
Curated by ChEMBL
LigandPNGBDBM50216970(2-(6-(2-(5-methyl-2-phenyloxazol-4-yl)ethoxy)-2,3-...)
Affinity DataEC50:  1.00E+4nM. Assay description: Agonist activity at PPARalpha by FRET assay
In DepthDetails ArticlePubMed