BDBM50217057 1-((2R,5S)-5-(2-(aminomethyl)thiazol-5-yl)bicyclo[3.1.0]hexan-2-yl)-3-(2,6-dichloropyridin-4-yl)-1-(3-((2S,5R)-2,5-dimethylpiperazin-1-yl)propyl)urea::CHEMBL237531
SMILES C[C@@H]1CN(CCCN([C@@H]2CC[C@@]3(CC23)c2cnc(CN)s2)C(=O)Nc2cc(Cl)nc(Cl)c2)[C@@H](C)CN1
InChI Key InChIKey=ZMZHZCSLQGDVJZ-GRVUMAGMSA-N
Data  1 KI
  Tab Delimited (TSV)   2D SDfile   Computed 3D by Vconf -m prep SDfile
Find this compound or compounds like it in BindingDB:
Activity Spreadsheet -- Enzyme Inhibition Constant Data from BindingDB
Found 1 hit for monomerid = 50217057
TargetMelanin-concentrating hormone receptor 1(Homo sapiens (Human))
Schering-Plough Research Institute
Curated by ChEMBL
LigandPNGBDBM50217057(1-((2R,5S)-5-(2-(aminomethyl)thiazol-5-yl)bicyclo[...)
Affinity DataKi:  13nM. Assay description: Antagonist activity at MCHR1
In DepthDetails ArticlePubMed