BDBM50217148 CHEMBL91510
SMILES CCCN(CCCCNC(=O)c1ccc(cc1)-c1ccccc1)C1CCc2nc(NC)ncc2C1
InChI Key InChIKey=JQQWLXXUXOPSDP-UHFFFAOYSA-N
Data  2 KI
  Tab Delimited (TSV)   2D SDfile   Computed 3D by Vconf -m prep SDfile
Find this compound or compounds like it in BindingDB:
Activity Spreadsheet -- Enzyme Inhibition Constant Data from BindingDB
Found 2 hits for monomerid = 50217148
TargetD(3) dopamine receptor(Homo sapiens (Human))
Smithkline Beecham Pharmaceuticals
Curated by ChEMBL
LigandPNGBDBM50217148(CHEMBL91510)
Affinity DataKi:  16nM. Assay description: Tested for the ability to displace [125I]iodosulpiride from human cloned Dopamine receptor D3, expressed in CHO cells
In DepthDetails ArticlePubMed
TargetD(2) dopamine receptor(Homo sapiens (Human))
Smithkline Beecham Pharmaceuticals
Curated by ChEMBL
LigandPNGBDBM50217148(CHEMBL91510)
Affinity DataKi:  2.51E+3nM. Assay description: Displacement of [125I]iodosulpiride from human Dopamine receptor D2 expressed in CHO cells
In DepthDetails ArticlePubMed