BDBM50217389 CHEMBL148215
SMILES C[C@@H]1CCc2ccc(Cl)c(Cl)c2CN1
InChI Key InChIKey=XEAHOJNGYGBQTH-SSDOTTSWSA-N
Data  2 KI
  Tab Delimited (TSV)   2D SDfile   Computed 3D by Vconf -m prep SDfile
Find this compound or compounds like it in BindingDB:
Activity Spreadsheet -- Enzyme Inhibition Constant Data from BindingDB
Found 2 hits for monomerid = 50217389
TargetPhenylethanolamine N-methyltransferase(Bos taurus (bovine))
University Of Kansas
Curated by ChEMBL
LigandPNGBDBM50217389(CHEMBL148215)
Affinity DataKi:  1.70E+3nM. Assay description: Inhibitory activity against bovine adrenal phenylethanolamine N-methyl-transferase (PNMT)
In DepthDetails ArticlePubMed
LigandPNGBDBM50217389(CHEMBL148215)
Affinity DataKi:  3.85E+3nM. Assay description: Inhibition of [3H]clonidine binding to the rat alpha-2-adrenoceptor
In DepthDetails ArticlePubMed