BDBM50217429 2S,3R,5S-4-{[2-carboxy-2-(2,4,6-trimethylbenzenesulfonylamino)ethylcarbamoyl]methoxy}-2-[(4-chloropyridin-2-ylamino)methyl]pyrrolidine-1-carboxylic acid benzyl ester::CHEMBL242704
SMILES Cc1cc(C)c(c(C)c1)S(=O)(=O)N[C@@H](CNC(=O)CO[C@@H]1C[C@@H](CNc2cc(Cl)ccn2)N(C1)C(=O)OCc1ccccc1)C(O)=O
InChI Key InChIKey=DLORZJRWPLTLNY-VJGNERBWSA-N
Data  1 IC50
  Tab Delimited (TSV)   2D SDfile   Computed 3D by Vconf -m prep SDfile
Find this compound or compounds like it in BindingDB:
Activity Spreadsheet -- Enzyme Inhibition Constant Data from BindingDB
Found 1 hit for monomerid = 50217429
TargetIntegrin alpha-5/beta-1(Homo sapiens (Human))
Jerini
Curated by ChEMBL
LigandPNGBDBM50217429(2S,3R,5S-4-{[2-carboxy-2-(2,4,6-trimethylbenzenesu...)
Affinity DataIC50:  445nM. Assay description: Inhibition of integrin alpha5beta1 receptor by ELISA
In DepthDetails ArticlePubMed