BDBM50217701 CHEMBL268395::N-((1R,2R)-2-aminocyclohexyl)-N-cinnamyl-4-(1H-indol-3-yl)butanamide
SMILES N[C@@H]1CCCC[C@H]1N(C\C=C\c1ccccc1)C(=O)CCCc1c[nH]c2ccccc12
InChI Key InChIKey=CTWATJKCCUTZQI-OAOUBSARSA-N
Data  4 KI
  Tab Delimited (TSV)   2D SDfile   Computed 3D by Vconf -m prep SDfile
Find this compound or compounds like it in BindingDB:
Activity Spreadsheet -- Enzyme Inhibition Constant Data from BindingDB
Found 4 hits for monomerid = 50217701
TargetMelanocyte-stimulating hormone receptor(Mus musculus)
Uppsala University
Curated by ChEMBL
LigandPNGBDBM50217701(CHEMBL268395 | N-((1R,2R)-2-aminocyclohexyl)-N-cin...)
Affinity DataKi:  1.20E+4nM. Assay description: Displacement of [125I]NDP-MSH from MC1 receptor in mouse B16 cells
In DepthDetails ArticlePubMed
TargetMelanocortin receptor 3(Homo sapiens (Human))
Uppsala University
Curated by ChEMBL
LigandPNGBDBM50217701(CHEMBL268395 | N-((1R,2R)-2-aminocyclohexyl)-N-cin...)
Affinity DataKi:  6.20E+4nM. Assay description: Displacement of [125I]NDP-MSH from human recombinant MC3 receptor expressed in Sf9 cells
In DepthDetails ArticlePubMed
TargetMelanocortin receptor 4(Homo sapiens (Human))
Uppsala University
Curated by ChEMBL
LigandPNGBDBM50217701(CHEMBL268395 | N-((1R,2R)-2-aminocyclohexyl)-N-cin...)
Affinity DataKi:  1.16E+5nM. Assay description: Displacement of [125I]NDP-MSH from human recombinant MC4 receptor expressed in Sf9 cells
In DepthDetails ArticlePubMed
TargetMelanocortin receptor 5(Homo sapiens (Human))
Uppsala University
Curated by ChEMBL
LigandPNGBDBM50217701(CHEMBL268395 | N-((1R,2R)-2-aminocyclohexyl)-N-cin...)
Affinity DataKi:  5.55E+5nM. Assay description: Displacement of [125I]NDP-MSH from human recombinant MC5 receptor expressed in Sf9 cells
In DepthDetails ArticlePubMed