BDBM50218018 CHEMBL249125::{[2-(2''-methoxy-[1,1';3',1'']terphenyl-4'-yloxy)-ethyl]-methyl-amino}-acetic acid
SMILES COc1ccccc1-c1cc(ccc1OCCN(C)CC(O)=O)-c1ccccc1
InChI Key InChIKey=IVAVUQGNAHXVRF-UHFFFAOYSA-N
Data  2 IC50
  Tab Delimited (TSV)   2D SDfile   Computed 3D by Vconf -m prep SDfile
Find this compound or compounds like it in BindingDB:
Activity Spreadsheet -- Enzyme Inhibition Constant Data from BindingDB
Found 2 hits for monomerid = 50218018
TargetSodium- and chloride-dependent glycine transporter 2(Homo sapiens (Human))
Eli Lilly
Curated by ChEMBL
LigandPNGBDBM50218018(CHEMBL249125 | {[2-(2''-methoxy-[1,1';3',1'']terph...)
Affinity DataIC50: >3.00E+4nM. Assay description: Inhibition of [14C]glycine reuptake at human GlyT2 expressed in BE(2)-C cells
In DepthDetails ArticlePubMed
TargetSodium- and chloride-dependent glycine transporter 1(Homo sapiens (Human))
Eli Lilly
Curated by ChEMBL
LigandPNGBDBM50218018(CHEMBL249125 | {[2-(2''-methoxy-[1,1';3',1'']terph...)
Affinity DataIC50:  351nM. Assay description: Inhibition of [14C]glycine reuptake at human GlyT1 expressed in BE(2)-C cells
In DepthDetails ArticlePubMed