BDBM50218544 CHEMBL88527
SMILES O=c1n(nc2c1cn(Cc1cccs1)c1ccccc21)C1CCCC1
InChI Key InChIKey=LHUZCHXUYPQSIH-UHFFFAOYSA-N
Data  3 IC50
  Tab Delimited (TSV)   2D SDfile   Computed 3D by Vconf -m prep SDfile
Find this compound or compounds like it in BindingDB:
Activity Spreadsheet -- Enzyme Inhibition Constant Data from BindingDB
Found 3 hits for monomerid = 50218544
TargetcAMP-specific 3',5'-cyclic phosphodiesterase 4A/4B/4C/4D(Homo sapiens (Human))
RhôNe-Poulenc Rorer
Curated by ChEMBL
LigandPNGBDBM50218544(CHEMBL88527)
Affinity DataIC50:  400nM. Assay description: Inhibitory potency against guinea pig ventricular phosphodiesterase 4
In DepthDetails ArticlePubMed
TargetcAMP-specific 3',5'-cyclic phosphodiesterase 4A/4B/4C/4D(RAT)
RhôNe-Poulenc Rorer
Curated by ChEMBL
LigandPNGBDBM50218544(CHEMBL88527)
Affinity DataIC50:  1.00E+3nM. Assay description: Displacement of [3H]rolipram from high affinity binding site (HARBS) in rat brain membrane.
In DepthDetails ArticlePubMed
TargetcGMP-inhibited 3',5'-cyclic phosphodiesterase 3A/3B(Homo sapiens (Human))
RhôNe-Poulenc Rorer
Curated by ChEMBL
LigandPNGBDBM50218544(CHEMBL88527)
Affinity DataIC50: >2.00E+4nM. Assay description: Inhibitory potency against guinea pig ventricular phosphodiesterase 3
In DepthDetails ArticlePubMed