BDBM50218681 CHEMBL98091
SMILES CCCc1nc(Nc2ccc(Cl)cc2Cl)n2ccnc(N(CC)CC)c12
InChI Key InChIKey=UIVDXALOJZCZHG-UHFFFAOYSA-N
Data  1 KI
  Tab Delimited (TSV)   2D SDfile   Computed 3D by Vconf -m prep SDfile
Find this compound or compounds like it in BindingDB:
Activity Spreadsheet -- Enzyme Inhibition Constant Data from BindingDB
Found 1 hit for monomerid = 50218681
TargetCorticotropin-releasing factor receptor 1/2(Rattus norvegicus (rat))
Dupont Pharmaceuticals
Curated by ChEMBL
LigandPNGBDBM50218681(CHEMBL98091)
Affinity DataKi:  825nM. Assay description: Binding affinity at corticotropin releasing hormone receptor in rat frontal cortex homogenates by [125I]Tyr-o-CRF displacement.
In DepthDetails ArticlePubMed