BDBM50218904 CHEMBL389962::N-benzoyl-N-(2-p-tolyl-2H-pyrazolo[3,4-c]quinolin-4-yl)-benzamide
SMILES Cc1ccc(cc1)-n1cc2c(n1)c(nc1ccccc21)N(C(=O)c1ccccc1)C(=O)c1ccccc1
InChI Key InChIKey=DLOZZCUQHMPIIQ-UHFFFAOYSA-N
Data  1 KI
  Tab Delimited (TSV)   2D SDfile   Computed 3D by Vconf -m prep SDfile
Find this compound or compounds like it in BindingDB:
Activity Spreadsheet -- Enzyme Inhibition Constant Data from BindingDB
Found 1 hit for monomerid = 50218904
TargetAdenosine receptor A3(Homo sapiens (Human))
Università
Curated by ChEMBL
LigandPNGBDBM50218904(CHEMBL389962 | N-benzoyl-N-(2-p-tolyl-2H-pyrazolo[...)
Affinity DataKi:  30nM. Assay description: Displacement of [125I]AB-MECA from human adenosine A3 receptor expressed in CHO cells
In DepthDetails ArticlePubMed