BDBM50218917 CHEMBL242632::N-(2-p-tolyl-2H-pyrazolo[3,4-c]quinolin-4-yl)benzamide
SMILES Cc1ccc(cc1)-n1cc2c(n1)c(NC(=O)c1ccccc1)nc1ccccc21
InChI Key InChIKey=ZARLKOOVPRBBPD-UHFFFAOYSA-N
Data  4 KI
  Tab Delimited (TSV)   2D SDfile   Computed 3D by Vconf -m prep SDfile
Find this compound or compounds like it in BindingDB:
Activity Spreadsheet -- Enzyme Inhibition Constant Data from BindingDB
Found 4 hits for monomerid = 50218917
TargetAdenosine receptor A3(Homo sapiens (Human))
Università
Curated by ChEMBL
LigandPNGBDBM50218917(CHEMBL242632 | N-(2-p-tolyl-2H-pyrazolo[3,4-c]quin...)
Affinity DataKi:  4.40nM. Assay description: Displacement of [125I]AB-MECA from human adenosine A3 receptor expressed in CHO cells
In DepthDetails ArticlePubMed
TargetAdenosine receptor A3(Homo sapiens (Human))
Università
Curated by ChEMBL
LigandPNGBDBM50218917(CHEMBL242632 | N-(2-p-tolyl-2H-pyrazolo[3,4-c]quin...)
Affinity DataKi:  4.40nM. Assay description: Displacement of [125I]AB-MECA from human adenosine A3 receptor expressed in CHO cells by scintillation counting
In DepthDetails ArticlePubMed
TargetAdenosine receptor A1(Homo sapiens (Human))
Università
Curated by ChEMBL
LigandPNGBDBM50218917(CHEMBL242632 | N-(2-p-tolyl-2H-pyrazolo[3,4-c]quin...)
Affinity DataKi:  629nM. Assay description: Displacement of [3H]DPCPX from human adenosine A1 receptor expressed in CHO cells by scintillation counting
In DepthDetails ArticlePubMed
TargetAdenosine receptor A1(Homo sapiens (Human))
Università
Curated by ChEMBL
LigandPNGBDBM50218917(CHEMBL242632 | N-(2-p-tolyl-2H-pyrazolo[3,4-c]quin...)
Affinity DataKi:  629nM. Assay description: Displacement of [3H]DPCPX from human adenosine A1 receptor expressed in CHO cells
In DepthDetails ArticlePubMed