BDBM50219126 CHEMBL95504
SMILES CC(C)[C@@H]1CN(CCN1)c1ccnc2ccc(NS(=O)(=O)c3sc4ccc(Cl)cc4c3C)cc12
InChI Key InChIKey=ZHKULDQPRKBNKV-QFIPXVFZSA-N
Data  1 KI
  Tab Delimited (TSV)   2D SDfile   Computed 3D by Vconf -m prep SDfile
Find this compound or compounds like it in BindingDB:
Activity Spreadsheet -- Enzyme Inhibition Constant Data from BindingDB
Found 1 hit for monomerid = 50219126
Target5-hydroxytryptamine receptor 6(Homo sapiens (Human))
Glaxosmithkline
Curated by ChEMBL
LigandPNGBDBM50219126(CHEMBL95504)
Affinity DataKi:  20nM. Assay description: Binding affinity against human 5-hydroxytryptamine 6 receptor
In DepthDetails ArticlePubMed