BDBM50219170 CHEMBL351543
SMILES Cc1ccc(s1)-c1ccccc1NCC1=NCCN1
InChI Key InChIKey=KMJVEYIACAOTSD-UHFFFAOYSA-N
Data  3 EC50
  Tab Delimited (TSV)   2D SDfile   Computed 3D by Vconf -m prep SDfile
Find this compound or compounds like it in BindingDB:
Activity Spreadsheet -- Enzyme Inhibition Constant Data from BindingDB
Found 3 hits for monomerid = 50219170
TargetAlpha-1A adrenergic receptor(Homo sapiens (Human))
Glaxosmithkline
Curated by ChEMBL
LigandPNGBDBM50219170(CHEMBL351543)
Affinity DataEC50:  36nM. Assay description: In vitro activation of human alpha-1A receptor expressed in rat-1 fibroblasts via calcium mobilization through the Gq coupled PLC pathway as function...
In DepthDetails ArticlePubMed
TargetAlpha-1D adrenergic receptor(Homo sapiens (Human))
Glaxosmithkline
Curated by ChEMBL
LigandPNGBDBM50219170(CHEMBL351543)
Affinity DataEC50: <1.00E+5nM. Assay description: In vitro activation of human alpha-1D receptor expressed in rat-1 fibroblasts via calcium using mobilization through the Gq coupled PLC pathway as fu...
In DepthDetails ArticlePubMed
TargetAlpha-1B adrenergic receptor(Homo sapiens (Human))
Glaxosmithkline
Curated by ChEMBL
LigandPNGBDBM50219170(CHEMBL351543)
Affinity DataEC50: <1.00E+5nM. Assay description: In vitro activation of human Alpha-1B receptor expressed in rat-1 fibroblasts via calcium mobilization through the Gq coupled PLC pathway as function...
In DepthDetails ArticlePubMed