BDBM50219300 CHEMBL356195
SMILES CO\N=C(/C)c1ccccc1NCC1=NCCN1
InChI Key InChIKey=NGYBTBMSZNTFFJ-LICLKQGHSA-N
Data  3 EC50
  Tab Delimited (TSV)   2D SDfile   Computed 3D by Vconf -m prep SDfile
Find this compound or compounds like it in BindingDB:
Activity Spreadsheet -- Enzyme Inhibition Constant Data from BindingDB
Found 3 hits for monomerid = 50219300
TargetAlpha-1B adrenergic receptor(Homo sapiens (Human))
Glaxosmithkline
Curated by ChEMBL
LigandPNGBDBM50219300(CHEMBL356195)
Affinity DataEC50: <5.01E+3nM. Assay description: In vitro activation of human Alpha-1B receptor expressed in rat-1 fibroblasts via calcium mobilization through the Gq coupled PLC pathway as function...
In DepthDetails ArticlePubMed
TargetAlpha-1D adrenergic receptor(Homo sapiens (Human))
Glaxosmithkline
Curated by ChEMBL
LigandPNGBDBM50219300(CHEMBL356195)
Affinity DataEC50: <5.01E+3nM. Assay description: In vitro activation of human alpha-1D receptor expressed in rat-1 fibroblasts via calcium using mobilization through the Gq coupled PLC pathway as fu...
In DepthDetails ArticlePubMed
TargetAlpha-1A adrenergic receptor(Homo sapiens (Human))
Glaxosmithkline
Curated by ChEMBL
LigandPNGBDBM50219300(CHEMBL356195)
Affinity DataEC50:  21nM. Assay description: In vitro activation of human alpha-1A receptor expressed in rat-1 fibroblasts via calcium mobilization through the Gq coupled PLC pathway as function...
In DepthDetails ArticlePubMed