BDBM50219568 4-bromo-3-carboxymethoxy-5-(3-{[1-(2-chlorophenylcarbamoyl)-piperidin-4-ylmethyl]amino}phenyl)thiophene-2-carboxylic acid::CHEMBL387614
SMILES OC(=O)COc1c(Br)c(sc1C(O)=O)-c1cccc(NCC2CCN(CC2)C(=O)Nc2ccccc2Cl)c1
InChI Key InChIKey=KREWQXMKBWYIBM-UHFFFAOYSA-N
Data  2 KI
  Tab Delimited (TSV)   2D SDfile   Computed 3D by Vconf -m prep SDfile
Find this compound or compounds like it in BindingDB:
Activity Spreadsheet -- Enzyme Inhibition Constant Data from BindingDB
Found 2 hits for monomerid = 50219568
TargetTyrosine-protein phosphatase non-receptor type 1(Homo sapiens (Human))
Wyeth Research
Curated by ChEMBL
LigandPNGBDBM50219568(4-bromo-3-carboxymethoxy-5-(3-{[1-(2-chlorophenylc...)
Affinity DataKi:  4nM. Assay description: Inhibition of human recombinant PTP1B
In DepthDetails ArticlePubMed
TargetTyrosine-protein phosphatase non-receptor type 2(Homo sapiens (Human))
Wyeth Research
Curated by ChEMBL
LigandPNGBDBM50219568(4-bromo-3-carboxymethoxy-5-(3-{[1-(2-chlorophenylc...)
Affinity DataKi:  6nM. Assay description: Inhibition of human recombinant TCPTP
In DepthDetails ArticlePubMed