BDBM50219665 4-(pyrimidin-4-ylamino)-N-(4-(4-(trifluoromethyl)phenyl)thiazol-2-yl)benzamide::CHEMBL248237
SMILES FC(F)(F)c1ccc(cc1)-c1csc(NC(=O)c2ccc(Nc3ccncn3)cc2)n1
InChI Key InChIKey=IMJQJDIOWHMZHO-UHFFFAOYSA-N
Data  2 EC50
  Tab Delimited (TSV)   2D SDfile   Computed 3D by Vconf -m prep SDfile
Find this compound or compounds like it in BindingDB:
Activity Spreadsheet -- Enzyme Inhibition Constant Data from BindingDB
Found 2 hits for monomerid = 50219665
TargetThrombopoietin receptor(Homo sapiens (Human))
Pfizer
Curated by ChEMBL
LigandPNGBDBM50219665(4-(pyrimidin-4-ylamino)-N-(4-(4-(trifluoromethyl)p...)
Affinity DataEC50:  490nM. Assay description: Agonist activity at TPO receptor
In DepthDetails ArticlePubMed
TargetThrombopoietin receptor(Homo sapiens (Human))
Pfizer
Curated by ChEMBL
LigandPNGBDBM50219665(4-(pyrimidin-4-ylamino)-N-(4-(4-(trifluoromethyl)p...)
Affinity DataEC50:  492nM. Assay description: Agonist activity at human TPOr expressed in BaF3 cells by reporter assay
In DepthDetails ArticlePubMed