BDBM50219759 CHEMBL285012
SMILES CN(CCCn1ccc2cc(ccc12)C(=O)N1CCC(CC1)N1C(=O)OCc2ccccc12)S(C)(=O)=O
InChI Key InChIKey=CFEMQYFHLLIQOO-UHFFFAOYSA-N
Data  1 KI
  Tab Delimited (TSV)   2D SDfile   Computed 3D by Vconf -m prep SDfile
Find this compound or compounds like it in BindingDB:
Activity Spreadsheet -- Enzyme Inhibition Constant Data from BindingDB
Found 1 hit for monomerid = 50219759
TargetOxytocin receptor(Homo sapiens (Human))
Glaxosmithkline
Curated by ChEMBL
LigandPNGBDBM50219759(CHEMBL285012)
Affinity DataKi:  158nM. Assay description: Ability to displace [3H]oxytocin from human OT receptor (hOT)
In DepthDetails ArticlePubMed