BDBM50219802 (1R,3S,4S)-methyl 3-(6-amino-9H-purin-9-yl)-4-hydroxycyclopentanecarboxylate::CHEMBL235072
SMILES COC(=O)[C@H]1C[C@H](O)[C@H](C1)n1cnc2c(N)ncnc12
InChI Key InChIKey=PPWYJCNBNCRAPZ-CSMHCCOUSA-N
Data  1 IC50
  Tab Delimited (TSV)   2D SDfile   Computed 3D by Vconf -m prep SDfile
Find this compound or compounds like it in BindingDB:
Activity Spreadsheet -- Enzyme Inhibition Constant Data from BindingDB
Found 1 hit for monomerid = 50219802
TargetcAMP-dependent protein kinase catalytic subunit alpha(Homo sapiens (Human))
University Of Tartu
Curated by ChEMBL
LigandPNGBDBM50219802((1R,3S,4S)-methyl 3-(6-amino-9H-purin-9-yl)-4-hydr...)
Affinity DataIC50: >1.00E+6nM. Assay description: Inhibition of cAPK Calpha in presence of 1 mM ATP
In DepthDetails ArticlePubMed