BDBM50220048 (1S,9R,18R,19S,21R,22R,23R,25R,32S,34R,35R,36S)-15,31-bis[2-(acetyloxy)ethyl]-24-phenyl-10,26-dioxa-8,15,24,31-tetraazaundecacyclo[29.5.2.0^{1,32}.0^{2,7}.0^{8,36}.0^{9,22}.0^{13,21}.0^{15,19}.0^{18,23}.0^{25,35}.0^{29,34}]octatriaconta-2,4,6,12,28-pentaene-15,31-diium dibromide::CHEMBL395960
SMILES CC(=O)OCC[N+]12CC[C@H]3[C@@H]1C[C@@H]1[C@@H]4[C@@H]3N([C@@H]3OCC=C5C[N+]6(CCOC(C)=O)CC[C@@]78[C@@H]6C[C@@H]5[C@@H]3[C@@H]7N([C@@H]4OCC=C1C2)c1ccccc81)c1ccccc1
InChI Key InChIKey=FNULMNZULDBPSF-XYMHRNEGSA-N
Data  3 KI  3 IC50
  Tab Delimited (TSV)   2D SDfile   Computed 3D by Vconf -m prep SDfile
Find this compound or compounds like it in BindingDB:
Activity Spreadsheet -- Enzyme Inhibition Constant Data from BindingDB
Found 6 hits for monomerid = 50220048
TargetNeuronal acetylcholine receptor subunit alpha-7(Homo sapiens (Human))
University Of Copenhagen
Curated by ChEMBL
LigandPNGBDBM50220048((1S,9R,18R,19S,21R,22R,23R,25R,32S,34R,35R,36S)-15...)
Affinity DataKi:  280nM. Assay description: Displacement of [3H]methyllycaconitine from human alpha-7 in tsA201 cells coexpressed with 5HT3A receptor
In DepthDetails ArticlePubMed
TargetNeuronal acetylcholine receptor subunit alpha-7(Homo sapiens (Human))
University Of Copenhagen
Curated by ChEMBL
LigandPNGBDBM50220048((1S,9R,18R,19S,21R,22R,23R,25R,32S,34R,35R,36S)-15...)
Affinity DataKi:  316nM. Assay description: Displacement of [3H]methyllycaconitine from alpha7 nAChR in tsA201 cells co-expressed with Ric3
In DepthDetails ArticlePubMed
Target5-hydroxytryptamine receptor 3A(Homo sapiens (Human))
University Of Copenhagen
Curated by ChEMBL
LigandPNGBDBM50220048((1S,9R,18R,19S,21R,22R,23R,25R,32S,34R,35R,36S)-15...)
Affinity DataKi: >1.00E+5nM. Assay description: Displacement of [3H]GR65630 from human 5HT3A receptor in HEK293 cells
In DepthDetails ArticlePubMed
TargetNeuronal acetylcholine receptor subunit alpha-7(Homo sapiens (Human))
University Of Copenhagen
Curated by ChEMBL
LigandPNGBDBM50220048((1S,9R,18R,19S,21R,22R,23R,25R,32S,34R,35R,36S)-15...)
Affinity DataIC50:  1.62E+3nM. Assay description: Antagonist activity at human alpha-7 nAChR in tsA201 cells coexpressed with Ric3 by FMP assay
In DepthDetails ArticlePubMed
TargetGlycine receptor subunit alpha-1(Homo sapiens (Human))
University Of Copenhagen
Curated by ChEMBL
LigandPNGBDBM50220048((1S,9R,18R,19S,21R,22R,23R,25R,32S,34R,35R,36S)-15...)
Affinity DataIC50: >1.00E+5nM. Assay description: Antagonist activity at human glycine alpha-1 receptor in HEK293 cells by FMP assay
In DepthDetails ArticlePubMed
Target5-hydroxytryptamine receptor 3A(Homo sapiens (Human))
University Of Copenhagen
Curated by ChEMBL
LigandPNGBDBM50220048((1S,9R,18R,19S,21R,22R,23R,25R,32S,34R,35R,36S)-15...)
Affinity DataIC50: >1.00E+5nM. Assay description: Antagonist activity at human 5HT3A receptor expressed in HEK293 cells by FMP assay
In DepthDetails ArticlePubMed