BDBM50220153 (2R,1'R,2'S)-2-(2'-sulfonocyclopropyl)glycine::CHEMBL389556
SMILES N[C@H]([C@H]1C[C@@H]1S(O)(=O)=O)C(O)=O
InChI Key InChIKey=XFYDZMMMXYAZLT-YVZJFKFKSA-N
Data  4 KI
  Tab Delimited (TSV)   2D SDfile   Computed 3D by Vconf -m prep SDfile
Find this compound or compounds like it in BindingDB:
Activity Spreadsheet -- Enzyme Inhibition Constant Data from BindingDB
Found 4 hits for monomerid = 50220153
TargetMetabotropic glutamate receptor 2(Homo sapiens (Human))
Universit£
Curated by ChEMBL
LigandPNGBDBM50220153((2R,1'R,2'S)-2-(2'-sulfonocyclopropyl)glycine | CH...)
Affinity DataKi: >3.00E+5nM. Assay description: Displacement of [3H]LY341495 from mGluR2 receptor expressed in BHK cells
In DepthDetails ArticlePubMed
TargetMetabotropic glutamate receptor 4(Homo sapiens (Human))
Universit£
Curated by ChEMBL
LigandPNGBDBM50220153((2R,1'R,2'S)-2-(2'-sulfonocyclopropyl)glycine | CH...)
Affinity DataKi: >3.00E+5nM. Assay description: Displacement of [3H]LAP4 from mGluR4 receptor expressed in BHK cells
In DepthDetails ArticlePubMed
TargetMetabotropic glutamate receptor 5(Homo sapiens (Human))
Universit£
Curated by ChEMBL
LigandPNGBDBM50220153((2R,1'R,2'S)-2-(2'-sulfonocyclopropyl)glycine | CH...)
Affinity DataKi: >3.00E+5nM. Assay description: Binding affinity to mGluR5 receptor expressed in BHK cells
In DepthDetails ArticlePubMed
TargetMetabotropic glutamate receptor 1(Homo sapiens (Human))
Universit£
Curated by ChEMBL
LigandPNGBDBM50220153((2R,1'R,2'S)-2-(2'-sulfonocyclopropyl)glycine | CH...)
Affinity DataKi: >3.00E+5nM. Assay description: Displacement of [3H]quisqualate from mGluR1 receptor expressed in BHK cells
In DepthDetails ArticlePubMed