BDBM50220269 6-(2,5-diaza-bicyclo[2.2.1]heptan-2-yl)-N-(2-aminophenyl)nicotinamide::CHEMBL237970
SMILES Nc1ccccc1NC(=O)c1ccc(nc1)N1CC2CC1CN2
InChI Key InChIKey=WDPBIGFWZKRZAX-UHFFFAOYSA-N
Data  1 IC50
  Tab Delimited (TSV)   2D SDfile   Computed 3D by Vconf -m prep SDfile
Find this compound or compounds like it in BindingDB:
Activity Spreadsheet -- Enzyme Inhibition Constant Data from BindingDB
Found 1 hit for monomerid = 50220269
TargetHistone deacetylase 1(Homo sapiens (Human))
Merck Research Laboratories
Curated by ChEMBL
LigandPNGBDBM50220269(6-(2,5-diaza-bicyclo[2.2.1]heptan-2-yl)-N-(2-amino...)
Affinity DataIC50:  307nM. Assay description: Inhibition of recombinant HDAC1
In DepthDetails ArticlePubMed